Reaction Details
TargetPlatelet-derived growth factor receptor beta
LigandBDBM50331033
Substrate/Competitorn/a
Meas. Tech.ChEMBL_684762 (CHEMBL1285789)
IC50 13±n/a nM
Citation Cho, TPDong, SYJun, FHong, FJLiang, YJLu, XHua, PJLi, LYLei, ZBing, HYing, ZQiong, LFBei, FBGuang, LLShen, GAHong, SGHong, SWTai, MX Novel potent orally active multitargeted receptor tyrosine kinase inhibitors: synthesis, structure-activity relationships, and antitumor activities of 2-indolinone derivatives. J Med Chem53:8140-9 (2010) 
 
Platelet-derived growth factor receptor beta
Name:Platelet-derived growth factor receptor beta
Type:Enzyme
Mol. Mass.:123922.25
Organism:Homo sapiens (Human)
Description:P09619
Residue:1106
BDBM50331033
NameBDBM50331033
Synonyms:(Z)-5-(2-Diethylamino-ethyl)-2-(5-fluoro-2-oxo-1,2-dihydro-indol-3-ylidenemethyl)-3-methyl-6,7,8,9-tetrahydro-1H,5H-1,5-diaza-cyclopentacycloocten-4-one | CHEMBL1277161
TypeSmall organic molecule
Emp. Form.C25H31FN4O2
Mol. Mass.438.5376
SMILESCCN(CC)CCN1CCCCc2[nH]c(\C=C3/C(=O)Nc4ccc(F)cc34)c(C)c2C1=O