Reaction Details
TargetVascular endothelial growth factor receptor 2
LigandBDBM50331023
Substrate/Competitorn/a
Meas. Tech.ChEMBL_684763 (CHEMBL1285790)
IC50 2±n/a nM
Citation Cho, TPDong, SYJun, FHong, FJLiang, YJLu, XHua, PJLi, LYLei, ZBing, HYing, ZQiong, LFBei, FBGuang, LLShen, GAHong, SGHong, SWTai, MX Novel potent orally active multitargeted receptor tyrosine kinase inhibitors: synthesis, structure-activity relationships, and antitumor activities of 2-indolinone derivatives. J Med Chem53:8140-9 (2010) 
 
Vascular endothelial growth factor receptor 2
Name:Vascular endothelial growth factor receptor 2
Type:Receptor Tyrosine Kinase
Mol. Mass.:151510.97
Organism:Homo sapiens (Human)
Description:P35968
Residue:1356
BDBM50331023
NameBDBM50331023
Synonyms:(Z)-2-(5-Fluoro-2-oxo-1,2-dihydroindol-3-ylidenemethyl)-5-(2-diethylaminoethyl)-3-methyl-1,5,6,7-tetrahydropyrrolo-[3,2-c]pyridin-4-one | CHEMBL1278146
TypeSmall organic molecule
Emp. Form.C23H27FN4O2
Mol. Mass.410.4845
SMILESCCN(CC)CCN1CCc2[nH]c(\C=C3/C(=O)Nc4ccc(F)cc34)c(C)c2C1=O