Reaction Details
TargetTransient receptor potential cation channel subfamily V member 1
LigandBDBM50331150
Substrate/Competitorn/a
Meas. Tech.ChEMBL_686303 (CHEMBL1293059)
IC50 9±n/a nM
Citation Hawryluk, NAMerit, JELebsack, ADBranstetter, BJHack, MDSwanson, NAo, HMaher, MPBhattacharya, AWang, QFreedman, JMScott, BPWickenden, ADChaplan, SRBreitenbucher, JG Discovery and synthesis of 6,7,8,9-tetrahydro-5H-pyrimido-[4,5-d]azepines as novel TRPV1 antagonists. Bioorg Med Chem Lett20:7137-41 (2010) 
 
Transient receptor potential cation channel subfamily V member 1
Name:Transient receptor potential cation channel subfamily V member 1
Type:Protein
Mol. Mass.:94960.75
Organism:Homo sapiens (Human)
Description:Q8NER1
Residue:839
BDBM50331150
NameBDBM50331150
Synonyms:CHEMBL1290369 | N-(4-tert-butylphenyl)-7-(3-(trifluoromethyl)pyridin-2-yl)-5,6,7,8-tetrahydropyrido[3,4-d]pyrimidin-4-amine
TypeSmall organic molecule
Emp. Form.C23H24F3N5
Mol. Mass.427.4654
SMILESCC(C)(C)c1ccc(Nc2ncnc3CN(CCc23)c2ncccc2C(F)(F)F)cc1