Reaction Details
TargetTransient receptor potential cation channel subfamily V member 1
LigandBDBM50331116
Substrate/Competitorn/a
Meas. Tech.ChEMBL_686303 (CHEMBL1293059)
IC50 6±n/a nM
Citation Hawryluk, NAMerit, JELebsack, ADBranstetter, BJHack, MDSwanson, NAo, HMaher, MPBhattacharya, AWang, QFreedman, JMScott, BPWickenden, ADChaplan, SRBreitenbucher, JG Discovery and synthesis of 6,7,8,9-tetrahydro-5H-pyrimido-[4,5-d]azepines as novel TRPV1 antagonists. Bioorg Med Chem Lett20:7137-41 (2010) 
 
Transient receptor potential cation channel subfamily V member 1
Name:Transient receptor potential cation channel subfamily V member 1
Type:Protein
Mol. Mass.:94960.75
Organism:Homo sapiens (Human)
Description:Q8NER1
Residue:839
BDBM50331116
NameBDBM50331116
Synonyms:2-morpholino-N-(4-(trifluoromethyl)phenyl)-7-(3-(trifluoromethyl)pyridin-2-yl)-6,7,8,9-tetrahydro-5H-pyrimido[5,4-d]azepin-4-amine US9422293, 40 and 40A | US9738649, Example 40A
TypeSmall organic molecule
Emp. Form.C25H24F6N6O
Mol. Mass.538.4881
SMILESFC(F)(F)c1ccc(Nc2nc(nc3CCN(CCc23)c2ncccc2C(F)(F)F)N2CCOCC2)cc1