Reaction Details
TargetCathepsin F
LigandBDBM50331772
Substrate/Competitorn/a
Meas. Tech.ChEMBL_686698 (CHEMBL1290878)
IC50 64±n/a nM
Citation Beaulieu, CIsabel, EFortier, AMassé, FMellon, CMéthot, NNdao, MNicoll-Griffith, DLee, DPark, HBlack, WC Identification of potent and reversible cruzipain inhibitors for the treatment of Chagas disease. Bioorg Med Chem Lett20:7444-9 (2010) 
 
Cathepsin F
Name:Cathepsin F
Type:PROTEIN
Mol. Mass.:53373.38
Organism:Homo sapiens (Human)
Description:ChEMBL_852650
Residue:484
BDBM50331772
NameBDBM50331772
Synonyms:(S)-N-((S)-1-cyano-2-phenylethyl)-2-((S)-1-(4'-((R)-2,2-difluoro-1-hydroxyethyl)biphenyl-4-yl)-2,2,2-trifluoroethylamino)-4-fluoro-4-methylpentanamide | CHEMBL1288527
TypeSmall organic molecule
Emp. Form.C31H31F6N3O2
Mol. Mass.591.5872
SMILESCC(C)(F)C[C@H](N[C@@H](c1ccc(cc1)-c1ccc(cc1)[C@@H](O)C(F)F)C(F)(F)F)C(=O)N[C@@H](Cc1ccccc1)C#N