Reaction Details
TargetCathepsin F
LigandBDBM50331769
Substrate/Competitorn/a
Meas. Tech.ChEMBL_686698 (CHEMBL1290878)
IC50 23±n/a nM
Citation Beaulieu, CIsabel, EFortier, AMassé, FMellon, CMéthot, NNdao, MNicoll-Griffith, DLee, DPark, HBlack, WC Identification of potent and reversible cruzipain inhibitors for the treatment of Chagas disease. Bioorg Med Chem Lett20:7444-9 (2010) 
 
Cathepsin F
Name:Cathepsin F
Type:PROTEIN
Mol. Mass.:53373.38
Organism:Homo sapiens (Human)
Description:ChEMBL_852650
Residue:484
BDBM50331769
NameBDBM50331769
Synonyms:(S)-N-((S)-1-cyano-2-(4-cyano-2-fluorophenyl)ethyl)-3-methyl-2-((S)-2,2,2-trifluoro-1-(4'-(methylsulfonyl)biphenyl-4-yl)ethylamino)butanamide | CHEMBL1288530
TypeSmall organic molecule
Emp. Form.C30H28F4N4O3S
Mol. Mass.600.627
SMILESCC(C)[C@H](N[C@@H](c1ccc(cc1)-c1ccc(cc1)S(C)(=O)=O)C(F)(F)F)C(=O)N[C@@H](Cc1ccc(cc1F)C#N)C#N