Reaction Details
TargetCathepsin B
LigandBDBM50331767
Substrate/Competitorn/a
Meas. Tech.ChEMBL_686697 (CHEMBL1290877)
IC50 41±n/a nM
Citation Beaulieu, CIsabel, EFortier, AMassé, FMellon, CMéthot, NNdao, MNicoll-Griffith, DLee, DPark, HBlack, WC Identification of potent and reversible cruzipain inhibitors for the treatment of Chagas disease. Bioorg Med Chem Lett20:7444-9 (2010) 
 
Cathepsin B
Name:Cathepsin B
Type:Enzyme
Mol. Mass.:37819.69
Organism:Homo sapiens (Human)
Description:gi_63102437
Residue:339
BDBM50331767
NameBDBM50331767
Synonyms:1-(4'-((S)-1-((S)-1-((S)-1-cyano-2-(4-cyano-2-fluorophenyl)ethylamino)-3-methyl-1-oxobutan-2-ylamino)-2,2,2-trifluoroethyl)biphenyl-4-yl)cyclopropanecarboxamide | CHEMBL1288531
TypeSmall organic molecule
Emp. Form.C33H31F4N5O2
Mol. Mass.605.6252
SMILESCC(C)[C@H](N[C@@H](c1ccc(cc1)-c1ccc(cc1)C1(CC1)C(N)=O)C(F)(F)F)C(=O)N[C@@H](Cc1ccc(cc1F)C#N)C#N