Reaction Details
TargetCathepsin F
LigandBDBM50331784
Substrate/Competitorn/a
Meas. Tech.ChEMBL_686698 (CHEMBL1290878)
IC50 3242±n/a nM
Citation Beaulieu, CIsabel, EFortier, AMassé, FMellon, CMéthot, NNdao, MNicoll-Griffith, DLee, DPark, HBlack, WC Identification of potent and reversible cruzipain inhibitors for the treatment of Chagas disease. Bioorg Med Chem Lett20:7444-9 (2010) 
 
Cathepsin F
Name:Cathepsin F
Type:PROTEIN
Mol. Mass.:53373.38
Organism:Homo sapiens (Human)
Description:ChEMBL_852650
Residue:484
BDBM50331784
NameBDBM50331784
Synonyms:(S)-N-((S)-1-cyano-3-phenylpropyl)-4-fluoro-4-methyl-2-((S)-2,2,2-trifluoro-1-(4'-(methylsulfonyl)biphenyl-4-yl)ethylamino)pentanamide | CHEMBL1288521
TypeSmall organic molecule
Emp. Form.C31H33F4N3O3S
Mol. Mass.603.671
SMILESCC(C)(F)C[C@H](N[C@@H](c1ccc(cc1)-c1ccc(cc1)S(C)(=O)=O)C(F)(F)F)C(=O)N[C@@H](CCc1ccccc1)C#N