Reaction Details
TargetAdenosine receptor A2b
LigandBDBM50331908
Substrate/Competitorn/a
Meas. Tech.ChEMBL_687325 (CHEMBL1292001)
Ki 21±n/a nM
Citation McGuinness, BFHo, KKStauffer, TMRokosz, LLMannava, NKultgen, SGSaionz, KKlon, AChen, WDesai, HRogers, WLWebb, MYin, JJiang, YLi, TYan, HJing, KZhang, SMajumdar, KKSrivastava, VSaha, S Discovery of novel quinolinone adenosine A2B antagonists. Bioorg Med Chem Lett20:7414-20 (2010) 
 
Adenosine receptor A2b
Name:Adenosine receptor A2b
Type:G Protein-Coupled Receptor (GPCR)
Mol. Mass.:36341.22
Organism:Homo sapiens (Human)
Description:n/a
Residue:332
BDBM50331908
NameBDBM50331908
Synonyms:CHEMBL1290436 | N-benzyl-2-(2-oxo-4-phenethyl-3-(thiazol-2-yl)-1,2-dihydroquinolin-6-yloxy)acetamide
TypeSmall organic molecule
Emp. Form.C29H25N3O3S
Mol. Mass.495.592
SMILESO=C(COc1ccc2[nH]c(=O)c(-c3nccs3)c(CCc3ccccc3)c2c1)NCc1ccccc1