Reaction Details
TargetHepatocyte growth factor receptor
LigandBDBM50333561
Substrate/Competitorn/a
Meas. Tech.ChEMBL_699677 (CHEMBL1648320)
IC50 19±n/a nM
Citation Zificsak, CATheroff, JPAimone, LDAlbom, MSAngeles, TSBrown, RAGalinis, DGrobelny, JVHerbertz, THusten, JKocsis, LSLoSardo, CMiknyoczki, SJMurthy, SRolon-Steele, DUnderiner, TLWells-Knecht, KJWorrell, CSZeigler, KSDorsey, BD 2,4-Diaminopyrimidine inhibitors of c-Met kinase bearing benzoxazepine anilines. Bioorg Med Chem Lett21:660-3 (2011) 
 
Hepatocyte growth factor receptor
Name:Hepatocyte growth factor receptor
Type:Protein
Mol. Mass.:155559.73
Organism:Homo sapiens (Human)
Description:P08581
Residue:1390
BDBM50333561
NameBDBM50333561
Synonyms:2-{5-Chloro-2-[3-(2-methoxy-ethyl)-2,3,4,5-tetrahydro-1H-benzo[d]azepin-7-ylamino]-pyrimidine-4-ylamino}-3-fluoro-N-methyl-benzamide | CHEMBL1642135
TypeSmall organic molecule
Emp. Form.C25H28ClFN6O2
Mol. Mass.498.98
SMILESCNC(=O)c1cccc(F)c1Nc1nc(Nc2ccc3CCN(CCOC)CCc3c2)ncc1Cl