Reaction Details
TargetBile acid receptor
LigandBDBM50334245
Substrate/Competitorn/a
Meas. Tech.ChEMBL_699400 (CHEMBL1647427)
IC50 3800±n/a nM
Citation Richter, HGBenson, GMBlum, DChaput, EFeng, SGardes, CGrether, UHartman, PKuhn, BMartin, REPlancher, JMRudolph, MGSchuler, FTaylor, SBleicher, KH Discovery of novel and orally active FXR agonists for the potential treatment of dyslipidemia& diabetes. Bioorg Med Chem Lett21:191-4 (2010) 
 
Bile acid receptor
Name:Bile acid receptor
Type:Nuclear Receptor
Mol. Mass.:55916.24
Organism:Homo sapiens (Human)
Description:Q96RI1
Residue:486
BDBM50334245
NameBDBM50334245
Synonyms:2-(2-(4-chlorophenyl)-1H-benzo[d]imidazol-1-yl)-N-cyclohexyl-2-(tetrahydro-2H-pyran-4-yl)acetamide | CHEMBL1642351
TypeSmall organic molecule
Emp. Form.C26H30ClN3O2
Mol. Mass.451.988
SMILESClc1ccc(cc1)-c1nc2ccccc2n1C(C1CCOCC1)C(=O)NC1CCCCC1