Reaction Details
TargetHistone deacetylase 2
LigandBDBM19410
Substrate/Competitorn/a
Meas. Tech.ChEMBL_700124 (CHEMBL1647006)
IC50 1000±n/a nM
Citation Wong, JCGuo, LPeng, ZZhang, WZhang, NLai, WZhang, ZZhang, CZhang, XSong, SPan, DXie, CLi, JNing, ZLu, XHe, YChen, L Application of p21 and klf2 reporter gene assays to identify selective histone deacetylase inhibitors for cancer therapy. Bioorg Med Chem Lett21:110-6 (2010) 
 
Histone deacetylase 2
Name:Histone deacetylase 2
Type:Chromatin regulator; hydrolase; repressor
Mol. Mass.:55356.54
Organism:Homo sapiens (Human)
Description:Q92769
Residue:488
BDBM19410
NameBDBM19410
Synonyms:CHEMBL27759 US11377423, MS-275 US9265734, MS-275 benzamide-type inhibitor, 3 | pyridin-3-ylmethyl N-({4-[(2-aminophenyl)carbamoyl]phenyl}methyl)carbamate
TypeSmall organic molecule
Emp. Form.C21H20N4O3
Mol. Mass.376.4085
SMILESNc1ccccc1NC(=O)c1ccc(CNC(=O)OCc2cccnc2)cc1