Reaction Details
Target5-hydroxytryptamine receptor 6
LigandBDBM50334752
Substrate/Competitorn/a
Meas. Tech.ChEMBL_699278 (CHEMBL1647098)
Ki 3.1±n/a nM
Citation Liu, KGRobichaud, AJGreenfield, AALo, JRGrosanu, CMattes, JFCai, YZhang, GMZhang, JYKowal, DMSmith, DLDi, LKerns, EHSchechter, LEComery, TA Identification of 3-sulfonylindazole derivatives as potent and selective 5-HT(6) antagonists. Bioorg Med Chem19:650-62 (2011) 
 
5-hydroxytryptamine receptor 6
Name:5-hydroxytryptamine receptor 6
Type:G Protein-Coupled Receptor (GPCR)
Mol. Mass.:46968.43
Organism:Homo sapiens (Human)
Description:P50406
Residue:440
BDBM50334752
NameBDBM50334752
Synonyms:3-(Phenylsulfonyl)-N-(piperidin-4-yl)-1H-indazol-5-amine HCl | CHEMBL1642880
TypeSmall organic molecule
Emp. Form.C18H20N4O2S
Mol. Mass.356.442
SMILESO=S(=O)(c1n[nH]c2ccc(NC3CCNCC3)cc12)c1ccccc1