Reaction Details
Target5-hydroxytryptamine receptor 6
LigandBDBM50334731
Substrate/Competitorn/a
Meas. Tech.ChEMBL_699278 (CHEMBL1647098)
Ki 0.70±n/a nM
Citation Liu, KGRobichaud, AJGreenfield, AALo, JRGrosanu, CMattes, JFCai, YZhang, GMZhang, JYKowal, DMSmith, DLDi, LKerns, EHSchechter, LEComery, TA Identification of 3-sulfonylindazole derivatives as potent and selective 5-HT(6) antagonists. Bioorg Med Chem19:650-62 (2011) 
 
5-hydroxytryptamine receptor 6
Name:5-hydroxytryptamine receptor 6
Type:G Protein-Coupled Receptor (GPCR)
Mol. Mass.:46968.43
Organism:Homo sapiens (Human)
Description:P50406
Residue:440
BDBM50334731
NameBDBM50334731
Synonyms:CHEMBL1642851 | [3-(Naphthalen-1-sulfonyl)-1H-indazol-5-yl]-piperidin-4-yl-amine HCl
TypeSmall organic molecule
Emp. Form.C22H22N4O2S
Mol. Mass.406.501
SMILESO=S(=O)(c1n[nH]c2ccc(NC3CCNCC3)cc12)c1cccc2ccccc12