Reaction Details
Target5-hydroxytryptamine receptor 6
LigandBDBM50334718
Substrate/Competitorn/a
Meas. Tech.ChEMBL_699278 (CHEMBL1647098)
Ki 3.5±n/a nM
Citation Liu, KGRobichaud, AJGreenfield, AALo, JRGrosanu, CMattes, JFCai, YZhang, GMZhang, JYKowal, DMSmith, DLDi, LKerns, EHSchechter, LEComery, TA Identification of 3-sulfonylindazole derivatives as potent and selective 5-HT(6) antagonists. Bioorg Med Chem19:650-62 (2011) 
 
5-hydroxytryptamine receptor 6
Name:5-hydroxytryptamine receptor 6
Type:G Protein-Coupled Receptor (GPCR)
Mol. Mass.:46968.43
Organism:Homo sapiens (Human)
Description:P50406
Residue:440
BDBM50334718
NameBDBM50334718
Synonyms:3-(Naphthalen-1-ylsulfonyl)-N-(piperidin-4-ylmethyl)-1Hindazol-5-amine HCl | CHEMBL1642853
TypeSmall organic molecule
Emp. Form.C23H24N4O2S
Mol. Mass.420.527
SMILESO=S(=O)(c1n[nH]c2ccc(NCC3CCNCC3)cc12)c1cccc2ccccc12