Reaction Details
Target5-hydroxytryptamine receptor 6
LigandBDBM50334720
Substrate/Competitorn/a
Meas. Tech.ChEMBL_699278 (CHEMBL1647098)
Ki 1.5±n/a nM
Citation Liu, KGRobichaud, AJGreenfield, AALo, JRGrosanu, CMattes, JFCai, YZhang, GMZhang, JYKowal, DMSmith, DLDi, LKerns, EHSchechter, LEComery, TA Identification of 3-sulfonylindazole derivatives as potent and selective 5-HT(6) antagonists. Bioorg Med Chem19:650-62 (2011) 
 
5-hydroxytryptamine receptor 6
Name:5-hydroxytryptamine receptor 6
Type:G Protein-Coupled Receptor (GPCR)
Mol. Mass.:46968.43
Organism:Homo sapiens (Human)
Description:P50406
Residue:440
BDBM50334720
NameBDBM50334720
Synonyms:3-Amino-N-[3-(naphthalen-1-sulfonyl)-1H-indazol-5-yl]-propionamide HCl | CHEMBL1642865
TypeSmall organic molecule
Emp. Form.C20H18N4O3S
Mol. Mass.394.447
SMILESNCCC(=O)Nc1ccc2[nH]nc(c2c1)S(=O)(=O)c1cccc2ccccc12