Reaction Details
Target5-hydroxytryptamine receptor 6
LigandBDBM50334730
Substrate/Competitorn/a
Meas. Tech.ChEMBL_699278 (CHEMBL1647098)
Ki 0.24±n/a nM
Citation Liu, KGRobichaud, AJGreenfield, AALo, JRGrosanu, CMattes, JFCai, YZhang, GMZhang, JYKowal, DMSmith, DLDi, LKerns, EHSchechter, LEComery, TA Identification of 3-sulfonylindazole derivatives as potent and selective 5-HT(6) antagonists. Bioorg Med Chem19:650-62 (2011) 
 
5-hydroxytryptamine receptor 6
Name:5-hydroxytryptamine receptor 6
Type:G Protein-Coupled Receptor (GPCR)
Mol. Mass.:46968.43
Organism:Homo sapiens (Human)
Description:P50406
Residue:440
BDBM50334730
NameBDBM50334730
Synonyms:3-(Naphthalen-1-ylsulfonyl)-5-(piperazin-1-ylmethyl)-1Hindazole HCl | CHEMBL1642864
TypeSmall organic molecule
Emp. Form.C22H22N4O2S
Mol. Mass.406.501
SMILESO=S(=O)(c1n[nH]c2ccc(CN3CCNCC3)cc12)c1cccc2ccccc12