Reaction Details
TargetDNA polymerase alpha catalytic subunit
LigandBDBM50335553
Substrate/Competitorn/a
Meas. Tech.ChEMBL_708956 (CHEMBL1665163)
IC50>100000±n/a nM
Citation Wolfgang, GHShibata, RWang, JRay, ASWu, SDoerrfler, EReiser, HLee, WABirkus, GChristensen, NDAndrei, GSnoeck, R GS-9191 is a novel topical prodrug of the nucleotide analog 9-(2-phosphonylmethoxyethyl)guanine with antiproliferative activity and possible utility in the treatment of human papillomavirus lesions. Antimicrob Agents Chemother53:2777-84 (2009) 
 
DNA polymerase alpha catalytic subunit
Name:DNA polymerase alpha catalytic subunit
Type:PROTEIN
Mol. Mass.:165895.25
Organism:Homo sapiens (Human)
Description:ChEMBL_1365493
Residue:1462
BDBM50335553
NameBDBM50335553
Synonyms:CHEMBL1652466 | [({[2-(2-amino-6-oxo-6,9-dihydro-3H-purin-9-yl)ethoxy]methyl}(hydroxy)phosphoryl)oxy]phosphonic acid
TypeSmall organic molecule
Emp. Form.C8H13N5O8P2
Mol. Mass.369.165
SMILESNc1nc2n(CCOCP(O)(=O)OP(O)(O)=O)cnc2c(=O)[nH]1