Reaction Details
TargetDNA polymerase beta
LigandBDBM50335556
Substrate/Competitorn/a
Meas. Tech.ChEMBL_708957 (CHEMBL1665164)
IC50 23000±n/a nM
Citation Wolfgang, GHShibata, RWang, JRay, ASWu, SDoerrfler, EReiser, HLee, WABirkus, GChristensen, NDAndrei, GSnoeck, R GS-9191 is a novel topical prodrug of the nucleotide analog 9-(2-phosphonylmethoxyethyl)guanine with antiproliferative activity and possible utility in the treatment of human papillomavirus lesions. Antimicrob Agents Chemother53:2777-84 (2009) 
 
DNA polymerase beta
Name:DNA polymerase beta
Type:Protein
Mol. Mass.:38188.76
Organism:Homo sapiens (Human)
Description:n/a
Residue:335
BDBM50335556
NameBDBM50335556
Synonyms:CHEMBL1652469 | [({[({2-[2-amino-6-(cyclopropylamino)-9H-purin-9-yl]ethoxy}methyl)(hydroxy)phosphoryl]oxy}(hydroxy)phosphoryl)oxy]phosphonic acid
TypeSmall organic molecule
Emp. Form.C11H19N6O10P3
Mol. Mass.488.224
SMILESNc1nc(NC2CC2)c2ncn(CCOCP(O)(=O)OP(O)(=O)OP(O)(O)=O)c2n1