Reaction Details
TargetProstaglandin D2 receptor 2
LigandBDBM50335958
Substrate/Competitorn/a
Meas. Tech.ChEMBL_716943 (CHEMBL1670971)
IC50 1±n/a nM
Citation Stock, NVolkots, DStebbins, KBroadhead, AStearns, BRoppe, JParr, TBaccei, CBain, GChapman, CCorrea, LDarlington, JKing, CLee, CLorrain, DSProdanovich, PSantini, AEvans, JFHutchinson, JHPrasit, P Sodium [2'-[(cyclopropanecarbonyl-ethyl-amino)-methyl]-4'-(6-ethoxy-pyridin-3-yl)-6-methoxy-biphenyl-3-yl]-acetate (AM432): a potent, selective prostaglandin D2 receptor antagonist. Bioorg Med Chem Lett21:1036-40 (2011) 
 
Prostaglandin D2 receptor 2
Name:Prostaglandin D2 receptor 2
Type:Enzyme
Mol. Mass.:43295.45
Organism:Homo sapiens (Human)
Description:Q9Y5Y4
Residue:395
BDBM50335958
NameBDBM50335958
Synonyms:2-(2'-(((benzyloxycarbonyl)(ethyl)amino)methyl)-4'-fluoro-6-methoxybiphenyl-3-yl)acetic acid | CHEMBL1668891
TypeSmall organic molecule
Emp. Form.C26H26FNO5
Mol. Mass.451.4867
SMILESCCN(Cc1cc(F)ccc1-c1cc(CC(O)=O)ccc1OC)C(=O)OCc1ccccc1