Reaction Details
TargetPotassium voltage-gated channel subfamily H member 2
LigandBDBM50336387
Substrate/Competitorn/a
Meas. Tech.ChEMBL_716794 (CHEMBL1670716)
IC50>20000±n/a nM
Citation Richter, HGBenson, GMBleicher, KHBlum, DChaput, EClemann, NFeng, SGardes, CGrether, UHartman, PKuhn, BMartin, REPlancher, JMRudolph, MGSchuler, FTaylor, S Optimization of a novel class of benzimidazole-based farnesoid X receptor (FXR) agonists to improve physicochemical and ADME properties. Bioorg Med Chem Lett21:1134-40 (2011) 
 
Potassium voltage-gated channel subfamily H member 2
Name:Potassium voltage-gated channel subfamily H member 2
Type:Multi-pass membrane protein
Mol. Mass.:126672.65
Organism:Homo sapiens (Human)
Description:Q12809
Residue:1159
BDBM50336387
NameBDBM50336387
Synonyms:(S)-4-(2-(2-(4-chlorophenyl)-5,6-difluoro-1H-benzo[d]imidazol-1-yl)-2-cyclohexylacetamido)-3-fluorobenzoic acid CHEMBL1615152 | FXR_58
TypeSmall organic molecule
Emp. Form.C28H23ClF3N3O3
Mol. Mass.541.949
SMILESOC(=O)c1ccc(NC(=O)[C@H](C2CCCCC2)n2c(nc3cc(F)c(F)cc23)-c2ccc(Cl)cc2)c(F)c1