Reaction Details
TargetCytochrome P450 3A4
LigandBDBM50336378
Substrate/Competitorn/a
Meas. Tech.ChEMBL_716789 (CHEMBL1670711)
IC50 7700±n/a nM
Citation Richter, HGBenson, GMBleicher, KHBlum, DChaput, EClemann, NFeng, SGardes, CGrether, UHartman, PKuhn, BMartin, REPlancher, JMRudolph, MGSchuler, FTaylor, S Optimization of a novel class of benzimidazole-based farnesoid X receptor (FXR) agonists to improve physicochemical and ADME properties. Bioorg Med Chem Lett21:1134-40 (2011) 
 
Cytochrome P450 3A4
Name:Cytochrome P450 3A4
Type:Enzyme
Mol. Mass.:57349.57
Organism:Homo sapiens (Human)
Description:n/a
Residue:503
BDBM50336378
NameBDBM50336378
Synonyms:(S)-2-(2-(4-chlorophenyl)-5,6-difluoro-1H-benzo[d]imidazol-1-yl)-2-cyclohexyl-N-(2-fluoro-4-(1H-tetrazol-5-yl)phenyl)acetamide | CHEMBL1668257
TypeSmall organic molecule
Emp. Form.C28H23ClF3N7O
Mol. Mass.565.977
SMILESFc1cc2nc(-c3ccc(Cl)cc3)n([C@@H](C3CCCCC3)C(=O)Nc3ccc(cc3F)-c3nnn[nH]3)c2cc1F