Reaction Details
TargetCytochrome P450 3A4
LigandBDBM50336388
Substrate/Competitorn/a
Meas. Tech.ChEMBL_716789 (CHEMBL1670711)
IC50>50000±n/a nM
Citation Richter, HGBenson, GMBleicher, KHBlum, DChaput, EClemann, NFeng, SGardes, CGrether, UHartman, PKuhn, BMartin, REPlancher, JMRudolph, MGSchuler, FTaylor, S Optimization of a novel class of benzimidazole-based farnesoid X receptor (FXR) agonists to improve physicochemical and ADME properties. Bioorg Med Chem Lett21:1134-40 (2011) 
 
Cytochrome P450 3A4
Name:Cytochrome P450 3A4
Type:Enzyme
Mol. Mass.:57349.57
Organism:Homo sapiens (Human)
Description:n/a
Residue:503
BDBM50336388
NameBDBM50336388
Synonyms:CHEMBL1668261 trans-4-((2S)-2-cyclohexyl-2-(2-(2,4-dimethoxypyridin-3-yl)-5,6-difluoro-1H-benzo[d]imidazol-1-yl)acetamido)cyclohexanecarboxylic acid
TypeSmall organic molecule
Emp. Form.C29H34F2N4O5
Mol. Mass.556.6009
SMILESCOc1ccc(-c2nc3cc(F)c(F)cc3n2[C@@H](C2CCCCC2)C(=O)N[C@H]2CC[C@@H](CC2)C(O)=O)c(OC)n1