Reaction Details
TargetBile acid receptor
LigandBDBM50336382
Substrate/Competitorn/a
Meas. Tech.ChEMBL_716785 (CHEMBL1670707)
EC50 36±n/a nM
Citation Richter, HGBenson, GMBleicher, KHBlum, DChaput, EClemann, NFeng, SGardes, CGrether, UHartman, PKuhn, BMartin, REPlancher, JMRudolph, MGSchuler, FTaylor, S Optimization of a novel class of benzimidazole-based farnesoid X receptor (FXR) agonists to improve physicochemical and ADME properties. Bioorg Med Chem Lett21:1134-40 (2011) 
 
Bile acid receptor
Name:Bile acid receptor
Type:Nuclear Receptor
Mol. Mass.:55916.24
Organism:Homo sapiens (Human)
Description:Q96RI1
Residue:486
BDBM50336382
NameBDBM50336382
Synonyms:(S)-3-(4-(2-(2-(4-chlorophenyl)-5,6-difluoro-1H-benzo[d]imidazol-1-yl)-2-cyclohexylacetamido)-3-fluorophenyl)propanoic acid | CHEMBL1668248
TypeSmall organic molecule
Emp. Form.C30H27ClF3N3O3
Mol. Mass.570.002
SMILESOC(=O)CCc1ccc(NC(=O)[C@H](C2CCCCC2)n2c(nc3cc(F)c(F)cc23)-c2ccc(Cl)cc2)c(F)c1