Reaction Details
TargetBile acid receptor
LigandBDBM28538
Substrate/Competitorn/a
Meas. Tech.ChEMBL_716785 (CHEMBL1670707)
EC50 85±n/a nM
Citation Richter, HGBenson, GMBleicher, KHBlum, DChaput, EClemann, NFeng, SGardes, CGrether, UHartman, PKuhn, BMartin, REPlancher, JMRudolph, MGSchuler, FTaylor, S Optimization of a novel class of benzimidazole-based farnesoid X receptor (FXR) agonists to improve physicochemical and ADME properties. Bioorg Med Chem Lett21:1134-40 (2011) 
 
Bile acid receptor
Name:Bile acid receptor
Type:Nuclear Receptor
Mol. Mass.:55916.24
Organism:Homo sapiens (Human)
Description:Q96RI1
Residue:486
BDBM28538
NameBDBM28538
Synonyms:Azepino[4,5-b]indole, 6i ethyl 3-[(3,4-difluorophenyl)carbonyl]-1,1-dimethyl-1H,2H,3H,6H-azepino[4,5-b]indole-5-carboxylate
TypeSmall organic molecule
Emp. Form.C24H22F2N2O3
Mol. Mass.424.4399
SMILESCCOC(=O)C1=CN(CC(C)(C)c2c1[nH]c1ccccc21)C(=O)c1ccc(F)c(F)c1