Reaction Details
TargetBile acid receptor
LigandBDBM50336396
Substrate/Competitorn/a
Meas. Tech.ChEMBL_716784 (CHEMBL1670706)
IC50 290±n/a nM
Citation Richter, HGBenson, GMBleicher, KHBlum, DChaput, EClemann, NFeng, SGardes, CGrether, UHartman, PKuhn, BMartin, REPlancher, JMRudolph, MGSchuler, FTaylor, S Optimization of a novel class of benzimidazole-based farnesoid X receptor (FXR) agonists to improve physicochemical and ADME properties. Bioorg Med Chem Lett21:1134-40 (2011) 
 
Bile acid receptor
Name:Bile acid receptor
Type:Nuclear Receptor
Mol. Mass.:55916.24
Organism:Homo sapiens (Human)
Description:Q96RI1
Residue:486
BDBM50336396
NameBDBM50336396
Synonyms:CHEMBL1668262 | trans-4-((2S)-2-(2-(4-chloro-2-methoxypyridin-3-yl)-5,6-difluoro-1H-benzo[d]imidazol-1-yl)-2-cyclohexylacetamido)cyclohexanecarboxylic acid
TypeSmall organic molecule
Emp. Form.C28H31ClF2N4O4
Mol. Mass.561.02
SMILESCOc1ccc(-c2nc3cc(F)c(F)cc3n2[C@@H](C2CCCCC2)C(=O)N[C@H]2CC[C@@H](CC2)C(O)=O)c(Cl)n1