Reaction Details
TargetBile acid receptor
LigandBDBM50336389
Substrate/Competitorn/a
Meas. Tech.ChEMBL_716784 (CHEMBL1670706)
IC50 320±n/a nM
Citation Richter, HGBenson, GMBleicher, KHBlum, DChaput, EClemann, NFeng, SGardes, CGrether, UHartman, PKuhn, BMartin, REPlancher, JMRudolph, MGSchuler, FTaylor, S Optimization of a novel class of benzimidazole-based farnesoid X receptor (FXR) agonists to improve physicochemical and ADME properties. Bioorg Med Chem Lett21:1134-40 (2011) 
 
Bile acid receptor
Name:Bile acid receptor
Type:Nuclear Receptor
Mol. Mass.:55916.24
Organism:Homo sapiens (Human)
Description:Q96RI1
Residue:486
BDBM50336389
NameBDBM50336389
Synonyms:CHEMBL1668241 | rac-2-(2-(2-(4-chlorophenyl)-5,6-difluoro-1H-benzo[d]imidazol-1-yl)-2-cyclohexylacetamido)benzoic acid
TypeSmall organic molecule
Emp. Form.C28H24ClF2N3O3
Mol. Mass.523.958
SMILESOC(=O)c1ccccc1NC(=O)C(C1CCCCC1)n1c(nc2cc(F)c(F)cc12)-c1ccc(Cl)cc1