Reaction Details
TargetBile acid receptor
LigandBDBM50336392
Substrate/Competitorn/a
Meas. Tech.ChEMBL_716785 (CHEMBL1670707)
EC50 1100±n/a nM
Citation Richter, HGBenson, GMBleicher, KHBlum, DChaput, EClemann, NFeng, SGardes, CGrether, UHartman, PKuhn, BMartin, REPlancher, JMRudolph, MGSchuler, FTaylor, S Optimization of a novel class of benzimidazole-based farnesoid X receptor (FXR) agonists to improve physicochemical and ADME properties. Bioorg Med Chem Lett21:1134-40 (2011) 
 
Bile acid receptor
Name:Bile acid receptor
Type:Nuclear Receptor
Mol. Mass.:55916.24
Organism:Homo sapiens (Human)
Description:Q96RI1
Residue:486
BDBM50336392
NameBDBM50336392
Synonyms:(S)-4-(2-(2-(4-chlorophenyl)-5-fluoro-1H-benzo[d]imidazol-1-yl)-2-cyclohexylacetamido)-3-fluorobenzoic acid | CHEMBL1668258
TypeSmall organic molecule
Emp. Form.C28H24ClF2N3O3
Mol. Mass.523.958
SMILESOC(=O)c1ccc(NC(=O)[C@H](C2CCCCC2)n2c(nc3cc(F)ccc23)-c2ccc(Cl)cc2)c(F)c1