Reaction Details
TargetCytochrome P450 2D6
LigandBDBM50336379
Substrate/Competitorn/a
Meas. Tech.ChEMBL_716790 (CHEMBL1670712)
IC50 50000±n/a nM
Citation Richter, HGBenson, GMBleicher, KHBlum, DChaput, EClemann, NFeng, SGardes, CGrether, UHartman, PKuhn, BMartin, REPlancher, JMRudolph, MGSchuler, FTaylor, S Optimization of a novel class of benzimidazole-based farnesoid X receptor (FXR) agonists to improve physicochemical and ADME properties. Bioorg Med Chem Lett21:1134-40 (2011) 
 
Cytochrome P450 2D6
Name:Cytochrome P450 2D6
Type:Protein
Mol. Mass.:55774.82
Organism:Homo sapiens (Human)
Description:P10635
Residue:497
BDBM50336379
NameBDBM50336379
Synonyms:(S)-3-chloro-4-(2-(2-(4-chlorophenyl)-5,6-difluoro-1H-benzo[d]imidazol-1-yl)-2-cyclohexylacetamido)benzoic acid FXR_27
TypeSmall organic molecule
Emp. Form.C28H23Cl2F2N3O3
Mol. Mass.558.403
SMILESOC(=O)c1ccc(NC(=O)[C@H](C2CCCCC2)n2c(nc3cc(F)c(F)cc23)-c2ccc(Cl)cc2)c(Cl)c1