Reaction Details
TargetCathepsin B
LigandBDBM50336545
Substrate/Competitorn/a
Meas. Tech.ChEMBL_724199 (CHEMBL1677263)
IC50 26000±n/a nM
Citation White, PWLlinàs-Brunet, MAmad, MBethell, RCBolger, GCordingley, MGDuan, JGarneau, MLagacé, LThibeault, DKukolj, G Preclinical characterization of BI 201335, a C-terminal carboxylic acid inhibitor of the hepatitis C virus NS3-NS4A protease. Antimicrob Agents Chemother54:4611-8 (2010) 
 
Cathepsin B
Name:Cathepsin B
Type:Enzyme
Mol. Mass.:37819.69
Organism:Homo sapiens (Human)
Description:gi_63102437
Residue:339
BDBM50336545
NameBDBM50336545
Synonyms:(1R,2S)-1-((2S,4R)-4-(8-bromo-2-(2-isobutyramidothiazol-4-yl)-7-methoxyquinolin-4-yloxy)-1-((S)-2-(cyclopentyloxycarbonylamino)-3,3-dimethylbutanoyl)pyrrolidine-2-carboxamido)-2-vinylcyclopropanecarboxylic acid N-[(cyclopentyloxy)carbonyl]-3-methyl-L-valyl-(4R)-4-[(8-bromo-7-methoxy-2-{2-[(2-methylpropanoyl)amino]-1,3-thiazol-4-yl}quinolin-4-yl)oxy]-N-[(1R,2S)-1-carboxy-2-ethenylcyclopropyl]-L-prolinamide
TypeSmall organic molecule
Emp. Form.C40H49BrN6O9S
Mol. Mass.869.821
SMILESCOc1ccc2c(O[C@@H]3C[C@H](N(C3)C(=O)[C@@H](NC(=O)OC3CCCC3)C(C)(C)C)C(=O)N[C@@]3(C[C@H]3C=C)C(O)=O)cc(nc2c1Br)-c1csc(NC(=O)C(C)C)n1