Reaction Details
TargetSphingosine 1-phosphate receptor 5
LigandBDBM50337592
Substrate/Competitorn/a
Meas. Tech.ChEMBL_728641 (CHEMBL1685771)
EC50 170±n/a nM
Citation Kurata, HOtsuki, KKusumi, KKurono, MTerakado, MSeko, TMizuno, HOno, THagiya, HMinami, MNakade, SHabashita, H Structure-activity relationship studies of sphingosine-1-phosphate receptor agonists with N-cinnamyl-ß-alanine moiety. Bioorg Med Chem Lett21:1390-3 (2011) 
 
Sphingosine 1-phosphate receptor 5
Name:Sphingosine 1-phosphate receptor 5
Type:G Protein-Coupled Receptor (GPCR)
Mol. Mass.:41796.42
Organism:Homo sapiens (Human)
Description:n/a
Residue:398
BDBM50337592
NameBDBM50337592
Synonyms:3-(3-(4-(5-phenylpentyloxy)phenyl)propylamino)propanoic acid | CHEMBL1683041
TypeSmall organic molecule
Emp. Form.C23H31NO3
Mol. Mass.369.4971
SMILESOC(=O)CCNCCCc1ccc(OCCCCCc2ccccc2)cc1