Reaction Details
TargetSphingosine 1-phosphate receptor 3
LigandBDBM50337598
Substrate/Competitorn/a
Meas. Tech.ChEMBL_728640 (CHEMBL1685770)
EC50 1900±n/a nM
Citation Kurata, HOtsuki, KKusumi, KKurono, MTerakado, MSeko, TMizuno, HOno, THagiya, HMinami, MNakade, SHabashita, H Structure-activity relationship studies of sphingosine-1-phosphate receptor agonists with N-cinnamyl-ß-alanine moiety. Bioorg Med Chem Lett21:1390-3 (2011) 
 
Sphingosine 1-phosphate receptor 3
Name:Sphingosine 1-phosphate receptor 3
Type:G Protein-Coupled Receptor (GPCR)
Mol. Mass.:42278.13
Organism:Homo sapiens (Human)
Description:Q99500
Residue:378
BDBM50337598
NameBDBM50337598
Synonyms:CHEMBL1683046 | trans-3-(2-methyl-3-(4-(3-phenylpropoxy)phenyl)allylamino)propanoic acid
TypeSmall organic molecule
Emp. Form.C22H27NO3
Mol. Mass.353.4547
SMILESC\C(CNCCC(O)=O)=C/c1ccc(OCCCc2ccccc2)cc1