Reaction Details
TargetC-C chemokine receptor type 5
LigandBDBM50339030
Substrate/Competitorn/a
Meas. Tech.ChEMBL_729859 (CHEMBL1697613)
IC50 1.2±n/a nM
Citation Xue, CBChen, LCao, GZhang, KWang, AMeloni, DGlenn, JAnand, RXia, MKong, LHuang, TFeng, HZheng, CLi, MGalya, LZhou, JShin, NBaribaud, FSolomon, KScherle, PZhao, BDiamond, SEmm, TKeller, DContel, NYeleswaram, SVaddi, KHollis, GNewton, RFriedman, SMetcalf, B. Discovery of INCB9471, a Potent, Selective, and Orally Bioavailable CCR5 Antagonist with Potent Anti-HIV-1 Activity. ACS Med Chem Lett1:483-487 (2010) 
 
C-C chemokine receptor type 5
Name:C-C chemokine receptor type 5
Type:Enzyme
Mol. Mass.:40540.21
Organism:Homo sapiens (Human)
Description:P51681
Residue:352
BDBM50339030
NameBDBM50339030
Synonyms:4,6-Dimethyl-5-[(4-methyl-4-{(3S)-3-methyl-4-[5-(trifluoromethyl)-2,3-dihydro-1H-inden-1-yl]piperazin-1-yl}piperidin-1-yl)carbonyl]pyrimidine | CHEMBL1688240
TypeSmall organic molecule
Emp. Form.C28H36F3N5O
Mol. Mass.515.6135
SMILESC[C@H]1CN(CCN1C1CCc2cc(ccc12)C(F)(F)F)C1(C)CCN(CC1)C(=O)c1c(C)ncnc1C