Reaction Details
TargetCytochrome P450 2C19
LigandBDBM50339033
Substrate/Competitorn/a
Meas. Tech.ChEMBL_729881 (CHEMBL1695235)
IC50>25000±n/a nM
Citation Xue, CBChen, LCao, GZhang, KWang, AMeloni, DGlenn, JAnand, RXia, MKong, LHuang, TFeng, HZheng, CLi, MGalya, LZhou, JShin, NBaribaud, FSolomon, KScherle, PZhao, BDiamond, SEmm, TKeller, DContel, NYeleswaram, SVaddi, KHollis, GNewton, RFriedman, SMetcalf, B. Discovery of INCB9471, a Potent, Selective, and Orally Bioavailable CCR5 Antagonist with Potent Anti-HIV-1 Activity. ACS Med Chem Lett1:483-487 (2010) 
 
Cytochrome P450 2C19
Name:Cytochrome P450 2C19
Type:Enzyme
Mol. Mass.:55935.47
Organism:Homo sapiens (Human)
Description:P33261
Residue:490
BDBM50339033
NameBDBM50339033
Synonyms:5-[(4-(3S)-4-[(1R,2R)-2-ethoxy-5-(trifluoromethyl)-2,3-dihydro-1H-inden-1-yl]-3-methylpiperazin-1-yl-4-methylpiperidin-1-yl)carbonyl]-4,6-dimethylpyrimidine | CHEMBL1688243
TypeSmall organic molecule
Emp. Form.C30H40F3N5O2
Mol. Mass.559.6661
SMILESCCO[C@@H]1Cc2cc(ccc2[C@H]1N1CCN(C[C@@H]1C)C1(C)CCN(CC1)C(=O)c1c(C)ncnc1C)C(F)(F)F