Reaction Details
TargetAromatase
LigandBDBM50339148
Substrate/Competitorn/a
Meas. Tech.ChEMBL_735765 (CHEMBL1693773)
IC50 32300±n/a nM
Citation Yang, JHKondratyuk, TPJermihov, KCMarler, LEQiu, XChoi, YCao, HYu, RSturdy, MHuang, RLiu, YWang, LQMesecar, ADvan Breemen, RBPezzuto, JMFong, HHChen, YGZhang, HJ Bioactive compounds from the fern Lepisorus contortus. J Nat Prod74:129-36 (2011) 
 
Aromatase
Name:Aromatase
Type:Enzyme
Mol. Mass.:57888.92
Organism:Homo sapiens (Human)
Description:P11511
Residue:503
BDBM50339148
NameBDBM50339148
Synonyms:CHEMBL1689258 | beta-(3,4-dihydroxyphenyl)ethyl-6-O-E-caffeoyl-O-[beta-D-apiofuranosyl-(1->2)]-beta-D-glucopyranoside
TypeSmall organic molecule
Emp. Form.C28H34O15
Mol. Mass.610.5606
SMILESOC[C@@]1(O)CO[C@@H](O[C@@H]2[C@@H](O)[C@H](O)[C@@H](COC(=O)\C=C\c3ccc(O)c(O)c3)O[C@H]2OCCc2ccc(O)c(O)c2)[C@@H]1O