Reaction Details
TargetCoagulation factor X
LigandBDBM50339719
Substrate/Competitorn/a
Meas. Tech.ChEMBL_735257 (CHEMBL1694519)
Ki 1±n/a nM
Citation Watson, NSAdams, CBelton, DBrown, DBurns-Kurtis, CLChaudry, LChan, CConvery, MADavies, DEExall, AMHarling, JDIrvine, SIrving, WRKleanthous, SMcLay, IMPateman, AJPatikis, ANRoethke, TJSenger, SStelman, GJToomey, JRWest, RIWhittaker, CZhou, PYoung, RJ The discovery of potent and long-acting oral factor Xa inhibitors with tetrahydroisoquinoline and benzazepine P4 motifs. Bioorg Med Chem Lett21:1588-92 (2011) 
 
Coagulation factor X
Name:Coagulation factor X
Type:Enzyme
Mol. Mass.:54726.60
Organism:Homo sapiens (Human)
Description:n/a
Residue:488
BDBM50339719
NameBDBM50339719
Synonyms:(S)-6-chloro-N-(2-oxo-1-(1,2,3,4-tetrahydroisoquinolin-6-yl)pyrrolidin-3-yl)naphthalene-2-sulfonamide | CHEMBL1689015
TypeSmall organic molecule
Emp. Form.C23H22ClN3O3S
Mol. Mass.455.957
SMILESClc1ccc2cc(ccc2c1)S(=O)(=O)N[C@H]1CCN(C1=O)c1ccc2CNCCc2c1