Reaction Details
TargetPotassium voltage-gated channel subfamily H member 2
LigandBDBM50340002
Substrate/Competitorn/a
Meas. Tech.ChEMBL_740013 (CHEMBL1763073)
IC50>10000±n/a nM
Citation Cheshire, DRÅberg, AAndersson, GMAndrews, GBeaton, HGBirkinshaw, TNBoughton-Smith, NConnolly, SCook, TRCooper, ACooper, SLCox, DDixon, JGensmantel, NHamley, PJHarrison, RHartopp, PKäck, HLeeson, PDLuker, TMete, AMillichip, INicholls, DJPimm, ADSt-Gallay, SAWallace, AV The discovery of novel, potent and highly selective inhibitors of inducible nitric oxide synthase (iNOS). Bioorg Med Chem Lett21:2468-71 (2011) 
 
Potassium voltage-gated channel subfamily H member 2
Name:Potassium voltage-gated channel subfamily H member 2
Type:Multi-pass membrane protein
Mol. Mass.:126672.65
Organism:Homo sapiens (Human)
Description:Q12809
Residue:1159
BDBM50340002
NameBDBM50340002
Synonyms:2-[[(1R)-3-Amino-1-phenylpropyl]oxy]-4-chloro-5-fluorobenzonitrile oxalate | CHEMBL1762479
TypeSmall organic molecule
Emp. Form.C16H14ClFN2O
Mol. Mass.304.747
SMILESNCC[C@@H](Oc1cc(Cl)c(F)cc1C#N)c1ccccc1