Reaction Details
TargetInsulin receptor
LigandBDBM50340143
Substrate/Competitorn/a
Meas. Tech.ChEMBL_741309 (CHEMBL1764778)
IC50 24±n/a nM
Citation Buchanan, JLNewcomb, JRCarney, DPChaffee, SCChai, LCupples, REpstein, LFGallant, PGu, YHarmange, JCHodge, KHouk, BEHuang, XJona, JJoseph, SJun, HTKumar, RLi, CLu, JMenges, TMorrison, MJNovak, PMvan der Plas, SRadinsky, RRose, PESawant, SSun, JRSurapaneni, STurci, SMXu, KYanez, EZhao, HZhu, X Discovery of 2,4-bis-arylamino-1,3-pyrimidines as insulin-like growth factor-1 receptor (IGF-1R) inhibitors. Bioorg Med Chem Lett21:2394-9 (2011) 
 
Insulin receptor
Name:Insulin receptor
Type:Receptor Tyrosine Kinase
Mol. Mass.:156322.60
Organism:Homo sapiens (Human)
Description:P06213
Residue:1382
BDBM50340143
NameBDBM50340143
Synonyms:CHEMBL1760057 | N2-(4-(3-(piperidin-1-yl)propoxy)phenyl)-N4-(quinolin-3-yl)pyrimidine-2,4-diamine
TypeSmall organic molecule
Emp. Form.C27H30N6O
Mol. Mass.454.5667
SMILESC(COc1ccc(Nc2nccc(Nc3cnc4ccccc4c3)n2)cc1)CN1CCCCC1