Reaction Details
TargetInsulin-like growth factor 1 receptor
LigandBDBM50340144
Substrate/Competitorn/a
Meas. Tech.ChEMBL_741201 (CHEMBL1764523)
IC50 36±n/a nM
Citation Buchanan, JLNewcomb, JRCarney, DPChaffee, SCChai, LCupples, REpstein, LFGallant, PGu, YHarmange, JCHodge, KHouk, BEHuang, XJona, JJoseph, SJun, HTKumar, RLi, CLu, JMenges, TMorrison, MJNovak, PMvan der Plas, SRadinsky, RRose, PESawant, SSun, JRSurapaneni, STurci, SMXu, KYanez, EZhao, HZhu, X Discovery of 2,4-bis-arylamino-1,3-pyrimidines as insulin-like growth factor-1 receptor (IGF-1R) inhibitors. Bioorg Med Chem Lett21:2394-9 (2011) 
 
Insulin-like growth factor 1 receptor
Name:Insulin-like growth factor 1 receptor
Type:Protein
Mol. Mass.:154776.79
Organism:Homo sapiens (Human)
Description:P08069
Residue:1367
BDBM50340144
NameBDBM50340144
Synonyms:CHEMBL1760058 | N2-(3-methoxy-4-(3-(piperidin-1-yl)propoxy)phenyl)-N4-(quinolin-3-yl)pyrimidine-2,4-diamine
TypeSmall organic molecule
Emp. Form.C28H32N6O2
Mol. Mass.484.5927
SMILESCOc1cc(Nc2nccc(Nc3cnc4ccccc4c3)n2)ccc1OCCCN1CCCCC1