Reaction Details
TargetInsulin-like growth factor 1 receptor
LigandBDBM50340141
Substrate/Competitorn/a
Meas. Tech.ChEMBL_741201 (CHEMBL1764523)
IC50 356±n/a nM
Citation Buchanan, JLNewcomb, JRCarney, DPChaffee, SCChai, LCupples, REpstein, LFGallant, PGu, YHarmange, JCHodge, KHouk, BEHuang, XJona, JJoseph, SJun, HTKumar, RLi, CLu, JMenges, TMorrison, MJNovak, PMvan der Plas, SRadinsky, RRose, PESawant, SSun, JRSurapaneni, STurci, SMXu, KYanez, EZhao, HZhu, X Discovery of 2,4-bis-arylamino-1,3-pyrimidines as insulin-like growth factor-1 receptor (IGF-1R) inhibitors. Bioorg Med Chem Lett21:2394-9 (2011) 
 
Insulin-like growth factor 1 receptor
Name:Insulin-like growth factor 1 receptor
Type:Protein
Mol. Mass.:154776.79
Organism:Homo sapiens (Human)
Description:P08069
Residue:1367
BDBM50340141
NameBDBM50340141
Synonyms:CHEMBL1760055 | N2-(3-chloro-4-methoxyphenyl)-N4-(quinolin-3-yl)pyrimidine-2,4-diamine
TypeSmall organic molecule
Emp. Form.C20H16ClN5O
Mol. Mass.377.827
SMILESCOc1ccc(Nc2nccc(Nc3cnc4ccccc4c3)n2)cc1Cl