Reaction Details
TargetInsulin-like growth factor 1 receptor
LigandBDBM50340139
Substrate/Competitorn/a
Meas. Tech.ChEMBL_741200 (CHEMBL1764522)
IC50 198±n/a nM
Citation Buchanan, JLNewcomb, JRCarney, DPChaffee, SCChai, LCupples, REpstein, LFGallant, PGu, YHarmange, JCHodge, KHouk, BEHuang, XJona, JJoseph, SJun, HTKumar, RLi, CLu, JMenges, TMorrison, MJNovak, PMvan der Plas, SRadinsky, RRose, PESawant, SSun, JRSurapaneni, STurci, SMXu, KYanez, EZhao, HZhu, X Discovery of 2,4-bis-arylamino-1,3-pyrimidines as insulin-like growth factor-1 receptor (IGF-1R) inhibitors. Bioorg Med Chem Lett21:2394-9 (2011) 
 
Insulin-like growth factor 1 receptor
Name:Insulin-like growth factor 1 receptor
Type:Protein
Mol. Mass.:154776.79
Organism:Homo sapiens (Human)
Description:P08069
Residue:1367
BDBM50340139
NameBDBM50340139
Synonyms:CHEMBL1760053 | N4-(quinolin-3-yl)-N2-(3-(trifluoromethoxy)phenyl)pyrimidine-2,4-diamine
TypeSmall organic molecule
Emp. Form.C20H14F3N5O
Mol. Mass.397.3533
SMILESFC(F)(F)Oc1cccc(Nc2nccc(Nc3cnc4ccccc4c3)n2)c1