Reaction Details
TargetRenin
LigandBDBM50340422
Substrate/Competitorn/a
Meas. Tech.ChEMBL_741040 (CHEMBL1764268)
IC50 5.3±n/a nM
Citation Aspiotis, RChen, ACauchon, EDubé, DFalgueyret, JPGagné, SGallant, MGrimm, ELHoule, RJuteau, HLacombe, PLaliberté, SLévesque, JFMacDonald, DMcKay, DPercival, MDRoy, PSoisson, SMWu, T The discovery and synthesis of potent zwitterionic inhibitors of renin. Bioorg Med Chem Lett21:2430-6 (2011) 
 
Renin
Name:Renin
Type:Enzyme
Mol. Mass.:45058.99
Organism:Homo sapiens (Human)
Description:n/a
Residue:406
BDBM50340422
NameBDBM50340422
Synonyms:(3R,4S)-N-(3-((1-((2H-tetrazol-5-yl)methyl)cyclopropyl)methoxy)-5-(3-methoxypropyl)benzyl)-N-cyclopropyl-4-(4-(2-(2,6-dichloro-4-methylphenoxy)ethoxy)phenyl)piperidine-3-carboxamide | CHEMBL1761674
TypeSmall organic molecule
Emp. Form.C41H50Cl2N6O5
Mol. Mass.777.779
SMILESCOCCCc1cc(CN(C2CC2)C(=O)[C@H]2CNCC[C@@H]2c2ccc(OCCOc3c(Cl)cc(C)cc3Cl)cc2)cc(OCC2(Cc3nnn[nH]3)CC2)c1