Reaction Details
TargetPotassium voltage-gated channel subfamily H member 2
LigandBDBM50340407
Substrate/Competitorn/a
Meas. Tech.ChEMBL_741041 (CHEMBL1764269)
Ki 80±n/a nM
Citation Aspiotis, RChen, ACauchon, EDubé, DFalgueyret, JPGagné, SGallant, MGrimm, ELHoule, RJuteau, HLacombe, PLaliberté, SLévesque, JFMacDonald, DMcKay, DPercival, MDRoy, PSoisson, SMWu, T The discovery and synthesis of potent zwitterionic inhibitors of renin. Bioorg Med Chem Lett21:2430-6 (2011) 
 
Potassium voltage-gated channel subfamily H member 2
Name:Potassium voltage-gated channel subfamily H member 2
Type:Multi-pass membrane protein
Mol. Mass.:126672.65
Organism:Homo sapiens (Human)
Description:Q12809
Residue:1159
BDBM50340407
NameBDBM50340407
Synonyms:(3R,4S)-N-cyclopropyl-4-(4-(2-(2,6-dichloro-4-methylphenoxy)ethoxy)phenyl)-N-(3-(2-methoxyethoxy)-5-(3-methoxypropyl)benzyl)piperidine-3-carboxamide | CHEMBL1761519
TypeSmall organic molecule
Emp. Form.C38H48Cl2N2O6
Mol. Mass.699.704
SMILESCOCCCc1cc(CN(C2CC2)C(=O)[C@H]2CNCC[C@@H]2c2ccc(OCCOc3c(Cl)cc(C)cc3Cl)cc2)cc(OCCOC)c1