Reaction Details
TargetMas-related G-protein coupled receptor member X1
LigandBDBM50340742
Substrate/Competitorn/a
Meas. Tech.ChEMBL_740644 (CHEMBL1763646)
IC50 758±n/a nM
Citation Bayrakdarian, MButterworth, JHu, YJSanthakumar, VTomaszewski, MJ Development of 2,4-diaminopyrimidine derivatives as novel SNSR4 antagonists. Bioorg Med Chem Lett21:2102-5 (2011) 
 
Mas-related G-protein coupled receptor member X1
Name:Mas-related G-protein coupled receptor member X1
Type:PROTEIN
Mol. Mass.:36253.68
Organism:Homo sapiens (Human)
Description:ChEMBL_516621
Residue:322
BDBM50340742
NameBDBM50340742
Synonyms:2-(4-(2-(4-chlorophenethylamino)pyrimidin-4-yl)piperazin-1-yl)-1-(piperidin-1-yl)ethanone | CHEMBL1762697
TypeSmall organic molecule
Emp. Form.C23H31ClN6O
Mol. Mass.442.985
SMILESClc1ccc(CCNc2nccc(n2)N2CCN(CC(=O)N3CCCCC3)CC2)cc1