Reaction Details
TargetMas-related G-protein coupled receptor member X1
LigandBDBM50340747
Substrate/Competitorn/a
Meas. Tech.ChEMBL_740644 (CHEMBL1763646)
IC50 88±n/a nM
Citation Bayrakdarian, MButterworth, JHu, YJSanthakumar, VTomaszewski, MJ Development of 2,4-diaminopyrimidine derivatives as novel SNSR4 antagonists. Bioorg Med Chem Lett21:2102-5 (2011) 
 
Mas-related G-protein coupled receptor member X1
Name:Mas-related G-protein coupled receptor member X1
Type:PROTEIN
Mol. Mass.:36253.68
Organism:Homo sapiens (Human)
Description:ChEMBL_516621
Residue:322
BDBM50340747
NameBDBM50340747
Synonyms:2-(4-(2-(4-chlorophenethylamino)pyrimidin-4-yl)piperazin-1-yl)-N-(3-methoxypropyl)-N-(pyridin-4-ylmethyl)acetamide | CHEMBL1762702
TypeSmall organic molecule
Emp. Form.C28H36ClN7O2
Mol. Mass.538.084
SMILESCOCCCN(Cc1ccncc1)C(=O)CN1CCN(CC1)c1ccnc(NCCc2ccc(Cl)cc2)n1