Reaction Details
TargetMas-related G-protein coupled receptor member X1
LigandBDBM50340748
Substrate/Competitorn/a
Meas. Tech.ChEMBL_740644 (CHEMBL1763646)
IC50 244±n/a nM
Citation Bayrakdarian, MButterworth, JHu, YJSanthakumar, VTomaszewski, MJ Development of 2,4-diaminopyrimidine derivatives as novel SNSR4 antagonists. Bioorg Med Chem Lett21:2102-5 (2011) 
 
Mas-related G-protein coupled receptor member X1
Name:Mas-related G-protein coupled receptor member X1
Type:PROTEIN
Mol. Mass.:36253.68
Organism:Homo sapiens (Human)
Description:ChEMBL_516621
Residue:322
BDBM50340748
NameBDBM50340748
Synonyms:2-(4-(2-(4-chlorophenethylamino)pyrimidin-4-yl)piperazin-1-yl)-N-ethyl-N-(pyridin-4-ylmethyl)acetamide | CHEMBL1762703
TypeSmall organic molecule
Emp. Form.C26H32ClN7O
Mol. Mass.494.032
SMILESCCN(Cc1ccncc1)C(=O)CN1CCN(CC1)c1ccnc(NCCc2ccc(Cl)cc2)n1