Reaction Details
TargetRAF proto-oncogene serine/threonine-protein kinase
LigandBDBM50340954
Substrate/Competitorn/a
Meas. Tech.ChEMBL_739836 (CHEMBL1762896)
IC50 180±n/a nM
Citation Crew, APBhagwat, SVDong, HBittner, MAChan, AChen, XCoate, HCooke, AGokhale, PCHonda, AJin, MKahler, JMantis, CMulvihill, MJTavares-Greco, PAVolk, BWang, JWerner, DSArnold, LDPachter, JAWild, RGibson, NW Imidazo[1,5-a]pyrazines: orally efficacious inhibitors of mTORC1 and mTORC2. Bioorg Med Chem Lett21:2092-7 (2011) 
 
RAF proto-oncogene serine/threonine-protein kinase
Name:RAF proto-oncogene serine/threonine-protein kinase
Type:Serine/threonine-protein kinase
Mol. Mass.:73082.52
Organism:Homo sapiens (Human)
Description:P04049
Residue:648
BDBM50340954
NameBDBM50340954
Synonyms:CHEMBL1762110 | Trans-N-((-4-(8-amino-1-(1H-indol-2-yl)imidazo[1,5-a]pyrazin-3-yl)cyclohexyl)methyl)acetamide
TypeSmall organic molecule
Emp. Form.C23H26N6O
Mol. Mass.402.4921
SMILESCC(=O)NC[C@H]1CC[C@@H](CC1)c1nc(-c2cc3ccccc3[nH]2)c2c(N)nccn12