Reaction Details
TargetSerine/threonine-protein kinase 36
LigandBDBM50341342
Substrate/Competitorn/a
Meas. Tech.ChEMBL_742528 (CHEMBL1769287)
Kd 330±n/a nM
Citation Goldstein, DMSoth, MGabriel, TDewdney, NKuglstatter, AArzeno, HChen, JBingenheimer, WDalrymple, SADunn, JFarrell, RFrauchiger, SLa Fargue, JGhate, MGraves, BHill, RJLi, FLitman, RLoe, BMcIntosh, JMcWeeney, DPapp, EPark, JReese, HFRoberts, RTRotstein, DSan Pablo, BSarma, KStahl, MSung, MLSuttman, RTSjogren, EBTan, YTrejo, AWelch, MWeller, PWong, BRZecic, H Discovery of 6-(2,4-difluorophenoxy)-2-[3-hydroxy-1-(2-hydroxyethyl)propylamino]-8-methyl-8H-pyrido[2,3-d]pyrimidin-7-one (pamapimod) and 6-(2,4-difluorophenoxy)-8-methyl-2-(tetrahydro-2H-pyran-4-ylamino)pyrido[2,3-d]pyrimidin-7(8H)-one (R1487) as orally bioavailable and highly selective inhibitors J Med Chem54:2255-65 (2011) 
 
Serine/threonine-protein kinase 36
Name:Serine/threonine-protein kinase 36
Type:PROTEIN
Mol. Mass.:143977.45
Organism:Homo sapiens (Human)
Description:ChEMBL_774576
Residue:1315
BDBM50341342
NameBDBM50341342
Synonyms:6-(2,4-difluorophenoxy)-8-methyl-2-(tetrahydro-2H-pyran-4-ylamino)pyrido[2,3-d]pyrimidin-7(8H)-one | CHEMBL1230122
TypeSmall organic molecule
Emp. Form.C19H18F2N4O3
Mol. Mass.388.368
SMILESCn1c2nc(NC3CCOCC3)ncc2cc(Oc2ccc(F)cc2F)c1=O