Reaction Details
TargetSteroid 17-alpha-hydroxylase/17,20 lyase
LigandBDBM50342186
Substrate/Competitorn/a
Meas. Tech.ChEMBL_742803 (CHEMBL1769806)
IC50 14±n/a nM
Citation Kaku, TTsujimoto, SMatsunaga, NTanaka, THara, TYamaoka, MKusaka, MTasaka, A 17,20-Lyase inhibitors. Part 3: Design, synthesis, and structure-activity relationships of biphenylylmethylimidazole derivatives as novel 17,20-lyase inhibitors. Bioorg Med Chem19:2428-42 (2011) 
 
Steroid 17-alpha-hydroxylase/17,20 lyase
Name:Steroid 17-alpha-hydroxylase/17,20 lyase
Type:Enzyme
Mol. Mass.:57255.68
Organism:Rattus norvegicus (Rat)
Description:P11715
Residue:507
BDBM50342186
NameBDBM50342186
Synonyms:(S)-N-(4'-(1-hydroxy-1-(1H-imidazol-4-yl)-2-methylpropyl)biphenyl-3-yl)acetamide | CHEMBL1766187
TypeSmall organic molecule
Emp. Form.C21H23N3O2
Mol. Mass.349.4262
SMILESCC(C)[C@@](O)(c1cnc[nH]1)c1ccc(cc1)-c1cccc(NC(C)=O)c1