Reaction Details
TargetSteroid 17-alpha-hydroxylase/17,20 lyase
LigandBDBM50342169
Substrate/Competitorn/a
Meas. Tech.ChEMBL_742804 (CHEMBL1769807)
IC50 19±n/a nM
Citation Kaku, TTsujimoto, SMatsunaga, NTanaka, THara, TYamaoka, MKusaka, MTasaka, A 17,20-Lyase inhibitors. Part 3: Design, synthesis, and structure-activity relationships of biphenylylmethylimidazole derivatives as novel 17,20-lyase inhibitors. Bioorg Med Chem19:2428-42 (2011) 
 
Steroid 17-alpha-hydroxylase/17,20 lyase
Name:Steroid 17-alpha-hydroxylase/17,20 lyase
Type:Enzyme
Mol. Mass.:57382.42
Organism:Homo sapiens (Human)
Description:E.coli expressing human CYP17
Residue:508
BDBM50342169
NameBDBM50342169
Synonyms:CHEMBL1766170 | rac-1-(4'-Fluoro[1,1'-biphenyl]-3-yl)-1-(1H-imidazol-4-yl)-2-methyl-1-propanol
TypeSmall organic molecule
Emp. Form.C19H19FN2O
Mol. Mass.310.3654
SMILESCC(C)C(O)(c1cnc[nH]1)c1cccc(c1)-c1ccc(F)cc1